{"text_format":"1","workbook":"xlsx","n_sheets":7,"sheets":["Projection Analysis","admin fee calculations","Tracking Actual Success Rate","Re-benchmarking Est. Yr 2 & 3","background leasing","background graph","New Increment estimating instru"],"not_rendered":{"charts":6,"images":2,"macros":0,"external_links":2,"defined_names":8,"comments":5,"pivot_tables":0},"unopened":[],"bounds":{"document_bytes":16777216,"sheet_cells":100000,"rows_first":2000,"rows_last":500,"rows_between":2000,"halvings":0,"cell_chars":16384,"cell_head_chars":4096},"cells_cut":0,"cells_raw":0,"read":"whole","date_system":"1900"}

{"sheet":"Projection Analysis","index":0,"n_rows":67,"n_cols":32,"rows_kept":67,"cut":false,"hidden":false,"merged":[[1,2,1,3],[3,6,3,7],[3,1,3,4],[5,9,5,10],[68,1,78,14],[13,12,13,13],[8,11,8,12],[3,14,3,16],[3,9,3,12],[5,11,5,12],[4,14,4,15]]}
[]
[null,"PHA Name",null,null,"PHA Number"]
[]
[null,"ACC and Funding Information",null,null,null,null,"Future Years Funding Pro-Ration Levels",null,null,"Program Projection Variables",null,null,null,null,"Leasing and Spending Outcomes: Current and Following Year Projections"]
[null,null,"Current Year","Following Year Estimate","Year 3 Estimate",null,"Following YR Re-Benchmarking Pro-ration",null,null,"Success Rate",null,"Annual Turnover rate",null,null,"Current Year End Projection",null,"Following Year Projection"]
[null,"Calendar Year",null,{"$f":"IF(C6 =\"\",\"\",C6+1)","v":""},{"$f":"IF(C6=\"\",\"\",D6+1)","v":""},null,null,null,null,"Time from Issuance to HAP eff Date",null,null,null,null,"UML % of ACC ",{"$f":"N28","v":{"$error":"#DIV/0!"}},{"$f":"N42","v":{"$error":"#DIV/0!"}}]
[null,"Beginning ACC # Vouchers",null,{"$f":"C31","v":0},null,null,null,null,null,"% Leased in 30 days",null,{"$f":"((K7*100)+(K8*200)+(K9*300)+(K10*400)+(K11*500))/100","v":0},"Average months from issuance to HAP EFF DATE",null,"HAP Total as % All Funds (ABA + NRA)",{"$f":"K29/(C10+C11)","v":{"$error":"#VALUE!"}},{"$f":"K43/(D10+D11)","v":{"$error":"#VALUE!"}}]
[null,"ABA Eligibility Funded",null,{"$f":"IF(H5=\"\",'Re-benchmarking Est. Yr 2 & 3'!C22,H5*'Re-benchmarking Est. Yr 2 & 3'!C22+H9)","v":{"$error":"#VALUE!"}},{"$f":"IF(H5=\"\",'Re-benchmarking Est. Yr 2 & 3'!C45,H5*'Re-benchmarking Est. Yr 2 & 3'!C45)","v":{"$error":"#VALUE!"}},null,null,null,null,"% leased in 30 to 60 days",null,null,null,null,"% ABA (only) Expended",{"$f":"O29","v":{"$error":"#VALUE!"}},{"$f":"O42","v":{"$error":"#VALUE!"}}]
[null,"Set Aside Funding",null,null,null,null,"Optional- additional ABA for new units pro-rated into Year 2",null,null,"% Leased in 60 to 90 days",null,"Cells to the left must add to 100%",null,null,"Projected Yr End NRA (HAP Equity )",{"$f":"C11+(C10-K29)","v":{"$error":"#VALUE!"}},{"$f":"(D11+D10)-K43","v":{"$error":"#VALUE!"}}]
[null,"Total ABA Funding",{"$f":"C9+C8","v":0},{"$f":"D8+D9+H9","v":{"$error":"#VALUE!"}},null,null,null,null,null,"% Leased in 90 to 120 days",null,"cells add to >>>>",{"$f":"K7+K8+K9+K10+K11","v":0},null,"NRA as % of ABA",{"$f":"P9/C10","v":{"$error":"#VALUE!"}},{"$f":"Q9/D10","v":{"$error":"#VALUE!"}}]
[null,"Beginning CY Net Restricted Assets (NRA)",null,{"$f":"IF(P9>0,P9,0)","v":{"$error":"#VALUE!"}},{"$f":"IF(Q9>0,Q9,0)","v":{"$error":"#VALUE!"}},null,null,"Admin Fee",null,"% Leased in 120 to 150 days",null,null,null,null,"Projected Admin Fees",{"$f":"IF(I13=\"\",'admin fee calculations'!D11,I13*'admin fee calculations'!D11)","v":0},{"$f":"IF(I13=\"\",'admin fee calculations'!D21,I13*'admin fee calculations'!D21)","v":0}]
[null,"Total Funding ",{"$f":"C8+C9+C11","v":0},{"$f":"D8+D9+D11","v":{"$error":"#VALUE!"}},{"$f":"E8+E9+E11","v":{"$error":"#VALUE!"}},null,"Col.A  - first 600 units","Col. B","Admin Fee Proration",null,null,null,null,null,"ABA per ACC unit month",{"$f":"C10/(C7*12)","v":{"$error":"#DIV/0!"}},{"$f":"D10/(C7*12)","v":{"$error":"#VALUE!"}}]
[]
[null,null,null,null,null,null,null,null,null,null,null,null,"Beginning Year Three Monthly Exp vs ABA",null,{"$f":"'background graph'!Q55","v":{"$error":"#VALUE!"}},{"$f":"IF(Q9<0,\"YR TWO NRA DEFICIT\",IF(O14<0,(Q9/O14)*-1,\"surplus\"))","v":{"$error":"#VALUE!"}},"# Months NRA will cover Yr 3 Monthly deficit"]
[]
[null,"Month","ACC Units (UMAs) (enter only if change )","ACTUAL Leased Units","Actual HAP","Vouchers issued, or projected to be issued","Other Planned additons or reductions to leased units","New Leasing from Issued Vouchers","Estimated  Attrition","Leased units: actual and Projected ","HAP Expense:  Actual  and Projected ","PUC Actual or Projected  ","Manual PUC Override","Cumulative Annual Leased %"," Cumulative  ABA Expended %","Monthly UML %","Monthly  ABA Expended %",null,null,null,null,null,null,null,null,null,null,null,null,null,"Actual PUC HAP","PROJECTED HAP"]
[null,"January",{"$f":"$C$7","v":0},null,null,null,null,{"$f":"'background leasing'!E16","v":0},{"$f":"(($M$5*J17)/12)*-1","v":0},{"$f":"D17","v":0},{"$f":"IF(E17>0,E17,AF17)","v":0},{"$f":"AE17","v":""},null,{"$f":"D17/C7","v":{"$error":"#DIV/0!"}},{"$f":"K17/(C10/12)","v":{"$error":"#DIV/0!"}},{"$f":"J17/C17","v":{"$error":"#DIV/0!"}},{"$f":"K17/($C$10/12)","v":{"$error":"#DIV/0!"}},null,null,null,null,null,null,null,null,null,null,null,null,null,{"$f":"IF(E17>0,E17/D17,\"\")","v":""},{"$f":"E17","v":0}]
[null,"February",{"$f":"C17","v":0},null,null,null,null,{"$f":"'background leasing'!F16","v":0},{"$f":"(($M$5*J17)/12)*-1","v":0},{"$f":"IF(D18>0,D18,J17+I18+G18+H18)","v":0},{"$error":"#VALUE!"},{"$f":"IF(M18=\"\",IF(AE18=\"\",L17,AE18),M18)","v":""},null,{"$f":"SUM(J$17:J18)/(SUM(C$17:C18))","v":{"$error":"#DIV/0!"}},{"$f":"SUM(K$17:K18)/(C$10/12*2)","v":{"$error":"#VALUE!"}},{"$f":"J18/C18","v":{"$error":"#DIV/0!"}},{"$error":"#VALUE!"},null,null,null,null,null,null,null,null,null,null,null,null,null,"",{"$f":"IF(E18>0,E18,L18*J18)","v":{"$error":"#VALUE!"}}]
[null,"March",{"$f":"C18","v":0},null,null,null,null,{"$f":"'background leasing'!G16","v":0},0,0,{"$error":"#VALUE!"},{"$f":"IF(M19=\"\",IF(AE19=\"\",L18,AE19),M19)","v":""},null,{"$f":"SUM(J$17:J19)/(SUM(C$17:C19))","v":{"$error":"#DIV/0!"}},{"$f":"SUM(K$17:K19)/(C$10/12*3)","v":{"$error":"#VALUE!"}},{"$error":"#DIV/0!"},{"$error":"#VALUE!"},null,null,null,null,null,null,null,null,null,null,null,null,null,"",{"$f":"IF(E19>0,E19,L19*J19)","v":{"$error":"#VALUE!"}}]
[null,"April",0,null,null,null,null,{"$f":"'background leasing'!H16","v":0},0,0,{"$error":"#VALUE!"},"",null,{"$f":"SUM(J$17:J20)/(SUM(C$17:C20))","v":{"$error":"#DIV/0!"}},{"$f":"SUM(K$17:K20)/(C$10/12*4)","v":{"$error":"#VALUE!"}},{"$error":"#DIV/0!"},{"$error":"#VALUE!"},null,null,null,null,null,null,null,null,null,null,null,null,null,"",{"$error":"#VALUE!"}]
{"$rows_left_out":48}
{"sheet":"admin fee calculations","index":1,"n_rows":2502,"n_cols":9,"rows_kept":2502,"cut":false,"hidden":false,"merged":[[0,5,0,8],[0,0,0,2],[3,0,3,3],[13,0,13,3]]}
["Administration Fee Projections",null,null,null,null,"2010 - Current Year HUD Admin Fee Schedule "]
[null,null,null,null,null,"HA Number","HA Name","Column A Fee Rate","Column B Fee Rate"]
[null,null,null,null,null,"AK901","AK HSG FINANCE CORP",81.88,76.430000000000007]
[{"$f":"'Projection Analysis'!C6","v":0},null,null,null,null,"AL001","HSG AUTH OF BIRMINGHAM DISTRICT",57.34,53.52]
[null,"UMLs","Per unit admin fee","Admin Fee Estimate",null,"AL002","MOBILE HOUSING BOARD",58.25,54.37]
["1st 7200 UMLs",{"$f":"IF('Projection Analysis'!J29>7200,7200,'Projection Analysis'!J29)","v":0},{"$f":"'Projection Analysis'!G13","v":0},{"$f":"IF(B6>B8,B8*C6,B6*C6)","v":0},null,"AL004","HA ANNISTON",56.74,52.96]
["over 7200 UMLs",{"$f":"IF('Projection Analysis'!J29>7200,'Projection Analysis'!J29-7200,0)","v":0},{"$f":"'Projection Analysis'!H13","v":0},{"$f":"IF(B9>B8,((B8-B6)*C7),B7*C7)","v":0},null,"AL005","HA PHENIX CITY",56.74,52.96]
["UMA cap",{"$f":"'Projection Analysis'!C29","v":0},null,null,null,"AL006","H/A CITY OF MONTGOMERY",56.74,52.96]
["total UMLs",{"$f":"B6+B7","v":0},null,{"$f":"D6+D7","v":0},null,"AL007","DOTHAN H/A",56.74,52.96]
[null,null,null,null,null,"AL008","HA SELMA",56.74,52.96]
["CY 2010 total",null,null,{"$f":"D9","v":0},null,"AL010","FAIRFIELD ALABAMA H/A",57.34,53.52]
[null,null,null,null,null,"AL011","HA FORT PAYNE",56.74,52.96]
[null,null,null,null,null,"AL012","HA JASPER",56.74,52.96]
[{"$f":"'Projection Analysis'!D6","v":""},null,null,null,null,"AL013","HA TARRANT",57.34,53.52]
[null,"UMLs","Per unit admin fee","Admin Fee Estimate",null,"AL014","HA GUNTERSVILLE",56.74,52.96]
["1st 7200 UMLs",{"$f":"IF('Projection Analysis'!J43>7200,7200,'Projection Analysis'!J43)","v":0},{"$f":"C6","v":0},{"$f":"IF(B16>B18,B18*C16,B16*C16)","v":0},null,"AL047","HA HUNTSVILLE",58.26,54.39]
["over 7200 UMLs",{"$f":"IF('Projection Analysis'!J43>7200,'Projection Analysis'!J43-7200,0)","v":0},{"$f":"C7","v":0},{"$f":"IF(B19>B18,((B18-B16)*C17),B17*C17)","v":0},null,"AL048","HA DECATUR",56.74,52.96]
["UMA Cap",{"$f":"'Projection Analysis'!C43","v":0},null,null,null,"AL049","HA GREATER GADSDEN",56.74,52.96]
["Total UMLs",{"$f":"B16+B17","v":0},null,{"$f":"D16+D17","v":0},null,"AL050","HA AUBURN",56.74,52.96]
[null,null,null,null,null,"AL052","HA CULLMAN",56.74,52.96]
{"$rows_left_out":2483}
{"sheet":"Tracking Actual Success Rate","index":2,"n_rows":34,"n_cols":36,"rows_kept":34,"cut":false,"hidden":false,"merged":[[1,0,14,0],[0,4,0,8],[0,9,0,20]]}
[null,null,null,null,{"$f":"'Projection Analysis'!C6-1","v":-1},null,null,null,null,{"$f":"'Projection Analysis'!C6","v":0}]
[null," Issuance Month","# issued Each Month","Eventual # leased","Aug","Sept","Oct","Nov","Dec","Jan","Feb","March","April","May","June","July","Aug","Sept","Oct","Nov","Dec",null,null,null,null,null,null,null,null,null,"30 days","60 days","90 days","120 days","150 days"]
[null,{"$f":" \"July  \"&$E$1","v":"July  -1"},null,{"$f":"SUM(E3:I3)","v":0},null,null,null,null,null,null,null,null,null,null,null,null,null,null,null,null,null,null,null,null,null,null,null,null,null,null,{"$f":"E3","v":0},{"$f":"F3","v":0},{"$f":"G3","v":0},{"$f":"H3","v":0},{"$f":"I3","v":0}]
[null,{"$f":" \"August  \"&$E$1","v":"August  -1"},null,{"$f":"SUM(F4:J4)","v":0},null,null,null,null,null,null,null,null,null,null,null,null,null,null,null,null,null,null,null,null,null,null,null,null,null,null,{"$f":"F4","v":0},{"$f":"G4","v":0},{"$f":"H4","v":0},{"$f":"I4","v":0},{"$f":"J4","v":0}]
[null,{"$f":" \"September  \"&$E$1","v":"September  -1"},null,{"$f":"SUM(G5:K5)","v":0},null,null,null,null,null,null,null,null,null,null,null,null,null,null,null,null,null,null,null,null,null,null,null,null,null,null,{"$f":"G5","v":0},{"$f":"H5","v":0},{"$f":"I5","v":0},{"$f":"J5","v":0},{"$f":"K5","v":0}]
[null,{"$f":" \"October  \"&$E$1","v":"October  -1"},null,{"$f":"SUM(H6:L6)","v":0},null,null,null,null,null,null,null,null,null,null,null,null,null,null,null,null,null,null,null,null,null,null,null,null,null,null,{"$f":"H6","v":0},{"$f":"I6","v":0},{"$f":"J6","v":0},{"$f":"K6","v":0},{"$f":"L6","v":0}]
[null,{"$f":" \"November  \"&$E$1","v":"November  -1"},null,{"$f":"SUM(I7:M7)","v":0},null,null,null,null,null,null,null,null,null,null,null,null,null,null,null,null,null,null,null,null,null,null,null,null,null,null,{"$f":"I7","v":0},{"$f":"J7","v":0},{"$f":"K7","v":0},{"$f":"L7","v":0},{"$f":"M7","v":0}]
[null,{"$f":" \"December  \"&$E$1","v":"December  -1"},null,{"$f":"SUM(J8:N8)","v":0},null,null,null,null,null,null,null,null,null,null,null,null,null,null,null,null,null,null,null,null,null,null,null,null,null,null,{"$f":"J8","v":0},{"$f":"K8","v":0},{"$f":"L8","v":0},{"$f":"M8","v":0},{"$f":"N8","v":0}]
[null,{"$f":" \"January  \"&$J$1","v":"January  0"},null,{"$f":"SUM(K9:O9)","v":0},null,null,null,null,null,null,null,null,null,null,null,null,null,null,null,null,null,null,null,null,null,null,null,null,null,null,{"$f":"K9","v":0},{"$f":"L9","v":0},{"$f":"M9","v":0},{"$f":"N9","v":0},{"$f":"O9","v":0}]
[null,{"$f":" \"February  \"&$J$1","v":"February  0"},null,{"$f":"SUM(L10:P10)","v":0},null,null,null,null,null,null,null,null,null,null,null,null,null,null,null,null,null,null,null,null,null,null,null,null,null,null,{"$f":"L10","v":0},{"$f":"M10","v":0},{"$f":"N10","v":0},{"$f":"O10","v":0},{"$f":"P10","v":0}]
[null,{"$f":" \"March  \"&$J$1","v":"March  0"},null,{"$f":"SUM(M11:Q11)","v":0},null,null,null,null,null,null,null,null,null,null,null,null,null,null,null,null,null,null,null,null,null,null,null,null,null,null,{"$f":"M11","v":0},{"$f":"N11","v":0},{"$f":"O11","v":0},{"$f":"P11","v":0},{"$f":"Q11","v":0}]
[null,{"$f":" \"April  \"&$J$1","v":"April  0"},null,{"$f":"SUM(N12:R12)","v":0},null,null,null,null,null,null,null,null,null,null,null,null,null,null,null,null,null,null,null,null,null,null,null,null,null,null,{"$f":"N12","v":0},{"$f":"O12","v":0},{"$f":"P12","v":0},{"$f":"Q12","v":0},{"$f":"R12","v":0}]
[null,{"$f":" \"May  \"&$J$1","v":"May  0"},null,{"$f":"SUM(O13:S13)","v":0},null,null,null,null,null,null,null,null,null,null,null,null,null,null,null,null,null,null,null,null,null,null,null,null,null,null,{"$f":"O13","v":0},{"$f":"P13","v":0},{"$f":"Q13","v":0},{"$f":"R13","v":0},{"$f":"S13","v":0}]
[null,{"$f":" \"June  \"&$J$1","v":"June  0"},null,{"$f":"SUM(P14:T14)","v":0},null,null,null,null,null,null,null,null,null,null,null,null,null,null,null,null,null,null,null,null,null,null,null,null,null,null,{"$f":"P14","v":0},{"$f":"Q14","v":0},{"$f":"R14","v":0},{"$f":"S14","v":0},{"$f":"T14","v":0}]
[null,{"$f":" \"July  \"&$J$1","v":"July  0"},null,{"$f":"SUM(Q15:U15)","v":0},null,null,null,null,null,null,null,null,null,null,null,null,null,null,null,null,null,null,null,null,null,null,null,null,null,null,{"$f":"Q15","v":0},{"$f":"R15","v":0},{"$f":"S15","v":0},{"$f":"T15","v":0},{"$f":"U15","v":0}]
[null,"Total",{"$f":"SUM(C3:C15)","v":0},{"$f":"SUM(D3:D15)","v":0},{"$f":"SUM(E3:E15)","v":0},{"$f":"SUM(F3:F15)","v":0},0,0,0,0,0,0,0,0,0,0,0,0,0,0,0,null,null,null,null,null,null,null,null,null,{"$f":"SUM(AE3:AE15)","v":0},{"$f":"SUM(AF3:AF15)","v":0},{"$f":"SUM(AG3:AG15)","v":0},{"$f":"SUM(AH3:AH15)","v":0},{"$f":"SUM(AI3:AI15)","v":0},{"$f":"SUM(AE16:AI16)","v":0}]
[]
[]
[null,null,null,null,null,null,null,null,null,null,null,null,null,null,null,null,null,null,null,null,null,null,null,null,null,null,null,null,null,null,{"$f":"AE16/$AJ16","v":{"$error":"#DIV/0!"}},{"$f":"AF16/$AJ16","v":{"$error":"#DIV/0!"}},{"$f":"AG16/$AJ16","v":{"$error":"#DIV/0!"}},{"$f":"AH16/$AJ16","v":{"$error":"#DIV/0!"}},{"$f":"AI16/$AJ16","v":{"$error":"#DIV/0!"}},{"$f":"SUM(AE19:AI19)","v":{"$error":"#DIV/0!"}}]
[null," Issuance Month","Success Rate","% Leased  in 30 days","% Leased  in 30 to 60 days","% Leased  in 60 - 90 days","% Leased  in 90 to 120 days","% Leased  in 90 to 120 days","Avg Months"]
{"$rows_left_out":15}
{"sheet":"Re-benchmarking Est. Yr 2 & 3","index":3,"n_rows":47,"n_cols":3,"rows_kept":47,"cut":false,"hidden":false,"merged":[[0,0,0,4],[3,0,3,2],[26,0,26,2]]}
["Re-Benchmarking and Set Aside - Years 2 and 3 Estimate"]
[]
[]
["Year 2 CY Re-Benchmark Period Jan - Dec Current Year"]
[]
["Months","UMLs","HAP Exp"]
["January",{"$f":"'Projection Analysis'!J17","v":0},{"$f":"'Projection Analysis'!K17","v":0}]
["February",{"$f":"'Projection Analysis'!J18","v":0},{"$f":"'Projection Analysis'!K18","v":{"$error":"#VALUE!"}}]
["March",{"$f":"'Projection Analysis'!J19","v":0},{"$f":"'Projection Analysis'!K19","v":{"$error":"#VALUE!"}}]
["April",{"$f":"'Projection Analysis'!J20","v":0},{"$f":"'Projection Analysis'!K20","v":{"$error":"#VALUE!"}}]
["May",{"$f":"'Projection Analysis'!J21","v":0},{"$f":"'Projection Analysis'!K21","v":{"$error":"#VALUE!"}}]
["June",{"$f":"'Projection Analysis'!J22","v":0},{"$f":"'Projection Analysis'!K22","v":{"$error":"#VALUE!"}}]
["July",{"$f":"'Projection Analysis'!J23","v":0},{"$f":"'Projection Analysis'!K23","v":{"$error":"#VALUE!"}}]
["August",{"$f":"'Projection Analysis'!J24","v":0},{"$f":"'Projection Analysis'!K24","v":{"$error":"#VALUE!"}}]
["September",{"$f":"'Projection Analysis'!J25","v":0},{"$f":"'Projection Analysis'!K25","v":{"$error":"#VALUE!"}}]
["October",{"$f":"'Projection Analysis'!J26","v":0},{"$f":"'Projection Analysis'!K26","v":{"$error":"#VALUE!"}}]
["November",{"$f":"'Projection Analysis'!J27","v":0},{"$f":"'Projection Analysis'!K27","v":{"$error":"#VALUE!"}}]
["December",{"$f":"'Projection Analysis'!J28","v":0},{"$f":"'Projection Analysis'!K28","v":{"$error":"#VALUE!"}}]
[]
["Total",{"$f":"SUM(B7:B18)","v":0},{"$f":"SUM(C7:C18)","v":{"$error":"#VALUE!"}}]
{"$rows_left_out":28}
{"sheet":"background leasing","index":4,"n_rows":44,"n_cols":17,"rows_kept":44,"cut":false,"hidden":false,"merged":[[38,9,38,16],[35,1,35,3],[17,0,35,0],[38,7,38,8],[34,1,34,2]]}
[]
[null,"Month","# issued Each Month","Eventual # leased","Jan","Feb","March","April","May","June","July","Aug","Sept","Oct","Nov","Dec","Total Projected leased"]
[null,"Jan",{"$f":"'Projection Analysis'!F17","v":0},{"$f":"C3*$D$39","v":0},null,{"$f":"$D3*$D$40","v":0},{"$f":"$D3*$D$41","v":0},{"$f":"$D3*$D$42","v":0},{"$f":"$D3*$D$43","v":0},{"$f":"$D3*$D$44","v":0},null,null,null,null,null,null,{"$f":"SUM(F3:P3)","v":0}]
[null,"Feb",{"$f":"'Projection Analysis'!F18","v":0},{"$f":"C4*$D$39","v":0},null,null,{"$f":"$D4*$D$40","v":0},{"$f":"$D4*$D$41","v":0},{"$f":"$D4*$D$42","v":0},{"$f":"$D4*$D$43","v":0},{"$f":"$D4*$D$44","v":0},null,null,null,null,null,{"$f":"SUM(E4:P4)","v":0}]
[null,"March",{"$f":"'Projection Analysis'!F19","v":0},0,null,null,null,{"$f":"$D5*$D$40","v":0},{"$f":"$D5*$D$41","v":0},{"$f":"$D5*$D$42","v":0},{"$f":"$D5*$D$43","v":0},{"$f":"$D5*$D$44","v":0},null,null,null,null,0]
[null,"April",{"$f":"'Projection Analysis'!F20","v":0},0,null,null,null,null,{"$f":"$D6*$D$40","v":0},{"$f":"$D6*$D$41","v":0},{"$f":"$D6*$D$42","v":0},{"$f":"$D6*$D$43","v":0},{"$f":"$D6*$D$44","v":0},null,null,null,0]
[null,"May",{"$f":"'Projection Analysis'!F21","v":0},0,null,null,null,null,null,{"$f":"$D7*$D$40","v":0},{"$f":"$D7*$D$41","v":0},{"$f":"$D7*$D$42","v":0},{"$f":"$D7*$D$43","v":0},{"$f":"$D7*$D$44","v":0},null,null,0]
[null,"June",{"$f":"'Projection Analysis'!F22","v":0},0,null,null,null,null,null,null,{"$f":"$D8*$D$40","v":0},{"$f":"$D8*$D$41","v":0},{"$f":"$D8*$D$42","v":0},{"$f":"$D8*$D$43","v":0},{"$f":"$D8*$D$44","v":0},null,0]
[null,"July",{"$f":"'Projection Analysis'!F23","v":0},0,null,null,null,null,null,null,null,{"$f":"$D9*$D$40","v":0},{"$f":"$D9*$D$41","v":0},{"$f":"$D9*$D$42","v":0},{"$f":"$D9*$D$43","v":0},{"$f":"$D9*$D$44","v":0},0]
[null,"Aug",{"$f":"'Projection Analysis'!F24","v":0},0,null,null,null,null,null,null,null,null,{"$f":"$D10*$D$40","v":0},{"$f":"$D10*$D$41","v":0},{"$f":"$D10*$D$42","v":0},{"$f":"$D10*$D$43","v":0},0]
[null,"Sept",{"$f":"'Projection Analysis'!F25","v":0},0,null,null,null,null,null,null,null,null,null,{"$f":"$D11*$D$40","v":0},{"$f":"$D11*$D$41","v":0},{"$f":"$D11*$D$42","v":0},0]
[null,"Oct",{"$f":"'Projection Analysis'!F26","v":0},0,null,null,null,null,null,null,null,null,null,null,{"$f":"$D12*$D$40","v":0},{"$f":"$D12*$D$41","v":0},0]
[null,"Nov",{"$f":"'Projection Analysis'!F27","v":0},0,null,null,null,null,null,null,null,null,null,null,null,{"$f":"$D13*$D$40","v":0},0]
[null,"Dec",{"$f":"'Projection Analysis'!F28","v":0},0,null,null,null,null,null,null,null,null,null,null,null,null,0]
[null,null,{"$f":"SUM(C3:C14)","v":0},null,"Jan","Feb","March","April","May","June","July","Aug","Sept","Oct","Nov","Dec",{"$f":"SUM(E21:H21)","v":0}]
[null,null,"Total Leased",null,{"$f":"SUM(E3:E14)","v":0},0,0,0,0,0,0,0,0,0,0,0,{"$f":"SUM(E16:P16)","v":0}]
[]
["following year leasing impact from current year issuances & Following Year Issuance","issued Aug Current Yr",null,null,{"$f":"D10*$D$44","v":0}]
[null,"issued Sept Current Yr",null,null,{"$f":"D11*$D$43","v":0},{"$f":"D11*D44","v":0}]
[null,"issued Oct Current Yr",null,null,{"$f":"D12*D42","v":0},{"$f":"D12*D43","v":0},{"$f":"D12*D44","v":0}]
{"$rows_left_out":25}
{"sheet":"background graph","index":5,"n_rows":56,"n_cols":18,"rows_kept":56,"cut":false,"hidden":false,"merged":[[54,13,55,14]]}
[]
[]
[]
[]
[]
[]
[]
[]
[]
[]
[]
[]
[]
[]
[]
[]
[]
[]
[]
[]
{"$rows_left_out":37}
{"sheet":"New Increment estimating instru","index":6,"n_rows":0,"n_cols":0,"rows_kept":0,"cut":false,"hidden":false,"merged":[]}